{"text_format":"1","workbook":"xlsx","n_sheets":7,"sheets":["COVER","INSTRUCTIONS","FSE","METADATA","FEEDBACK","FSE Classification","CODES Mapping"],"not_rendered":{"charts":0,"images":2,"macros":1,"external_links":1,"defined_names":2,"comments":0,"pivot_tables":0},"unopened":[],"bounds":{"document_bytes":16777216,"sheet_cells":100000,"rows_first":2000,"rows_last":500,"rows_between":2000,"halvings":0,"cell_chars":16384,"cell_head_chars":4096},"cells_cut":0,"cells_raw":0,"read":"whole","date_system":"1900"}

{"sheet":"COVER","index":0,"n_rows":23,"n_cols":12,"rows_kept":23,"cut":false,"hidden":false,"merged":[[15,1,15,6],[15,7,15,14],[8,18,9,20],[13,1,13,6],[13,7,13,14],[14,1,14,6],[14,7,14,14],[21,1,21,6],[21,7,21,14],[22,1,22,6],[22,7,22,14],[17,1,17,14],[18,1,18,6],[18,7,18,14],[19,1,19,6],[19,7,19,14],[20,1,20,6],[20,7,20,14]]}
[]
[null,null,null,null,null,null,null,null,null,null,"domain:","FSE"]
[null,null,null,null,null,null,null,null,null,null,"country:","<CountryName>"]
[null,null,null,null,null,null,null,null,null,null,"data call:",2021]
[]
[]
[]
[]
[]
[]
[null,"Before starting, please read carefully the information provided in INSTRUCTIONS, as it will help you to accurately fill out the questionnaire. "]
[null,"Green tabs are the ones where your input is needed; FEEDBACK is optional."]
[]
[null,"Please send back your response to:",null,null,null,null,null,"fish.contact@oecd.org"]
[null,"We kindly ask you to provide a reply by:",null,null,null,null,null,"2021-10-31"]
[null,"For any doubt or question, please feel free to contact:",null,null,null,null,null,"Mrs. Fabiana Cerasa, Tel: +33 (0)1 45 24 95 60, E-mail: fabiana.cerasa@oecd.org"]
[]
[null,"Please fill in the fields below with your contact information"]
[null,"Reporter name:"]
[null,"Title:"]
[null,"Organisation and Unit:"]
[null,"Tel:"]
[null,"e-mail:"]

{"sheet":"INSTRUCTIONS","index":1,"n_rows":29,"n_cols":2,"rows_kept":29,"cut":false,"hidden":false,"merged":[]}
[]
[null,"What does FSE mean?"]
[null,"The Fisheries Support Estimate (FSE) questionnaire requires information on all programmes supporting fisheries in place in your country, i.e. any programme that benefits fishers, individually or collectively."]
[null,"The methodological document of reference for the Fisheries Support Estimate (FSE) statistics is the FSE Manual, available at the link below:"]
[null,"http://stats.oecd.org/wbos/fileview2.aspx?IDFile=d6312066-404a-4e18-a38e-e09d74610fac"]
[]
[null,"Which programmes should be reported in the questionnaire and how should these be recorded?"]
[null,"Report only policy measures where fishers (individually or collectively - i.e. as entrepreneurs or a sector) are the only or the principal intended recipients of economic transfers generated by it (Principle 1 of the Manual)"]
[null,"Do not report general policy measures available throughout the entire economy, not specifically altering the economic conditions for fisheries, even if such measures create policy transfers to or from the fisheries (Principle 2 of the Manual)"]
[null,"Report only transfers recorded in gross terms; no adjustment should be made for costs incurred by fishers in order to receive the support, e.g. costs to meet compliance conditions attached to certain payments, or tax clawbacks (Principle 3 of the Manual)"]
[null,"Report both quantitative and qualitative data, covering respectively the level and the characteristics of support (Principle 4 of the Manual)"]
[null,"Report any policy measure that benefit fishers, regardless the nature, objectives or economic impacts of it (Principle 5 of the Manual)"]
[]
[null,"Please follow these simple rules when compiling the questionnaire:"]
[null,"Do not remove any row or column from the data tab"]
[null,"Report 0 (=zero) only when the figure is a real zero"]
[null,"Leave the cell empty if the figure is not available"]
[null,"Do not use any other symbol (e.g. *, n.a., -, etc.)"]
[null,"Do not type any text as cell comment"]
[null,"Report value data in national currency, and, when a change of currency occurred, report data in the most recent currency"]
[null,"Report data referring to the calendar year -  all programmes reported on a fiscal year basis should be allocated to the first calendar year of a given fiscal year"]
[null,"Use only the original file sent by the OECD Secretariat, and please neither use a copy of the file nor a completely different file as this will make the data processing significantly harder for the OECD Secretariat, and may lead to high risks of errors and inaccuracies"]
[]
[null,"If the questionnaire is prefilled is because you have already provided any data/metadata in the past years, so please:"]
[null,"Check it carefully"]
[null,"Make corrections where necessary"]
[null,"Fill in any gap in the past submission"]
[]
[null,"HOW TO FILL IN THE QUESTIONNAIRE:"]

{"sheet":"FSE","index":2,"n_rows":51,"n_cols":32,"rows_kept":51,"cut":false,"hidden":false,"merged":[[5,1,5,31]]}
[]
[]
[]
[]
[]
[null,"Fisheries Support Estimate (FSE), National currency"]
[]
[]
[]
[]
[]
[null,null,"START YEAR","END YEAR","PRODUCTION-LINKED","INCOME OR EFFORT THRESHOLD","FISHING BEHAVIOUR CONSTRAINTS REQUIRED","RESTRICTED TO SPECIFIC SPECIES OR GEAR OR AREA","VESSEL LENGTH LIMITS","KIND OF RECIPIENT","PRIVATE CO-FINANCING REQUIRED",2000,2001,2002,2003,2004,2005,2006,2007,2008,2009,2010,2011,2012,2013,2014,2015,2016,2017,2018,2019,2020]
["FSE","FISHERIES SUPPORT ESTIMATE - TOTAL","-","-","-","-","-","-","-","-","-",{"$f":"IF(OR(ISNUMBER(L14),ISNUMBER(L18)),SUM(L14,L18),\"\")","v":""},"","","","","","","","","","","","","","","","","","",{"$f":"IF(OR(ISNUMBER(AE14),ISNUMBER(AE18)),SUM(AE14,AE18),\"\")","v":""},""]
["FSE_NON","FISHERIES SUPPORT ESTIMATE - Non Budgetary","-","-","-","-","-","-","-","-","-",{"$f":"IF(OR(ISNUMBER(L15)),SUM(L15),\"\")","v":""},{"$f":"IF(OR(ISNUMBER(M15)),SUM(M15),\"\")","v":""},"","","","","","","","","","","","","","","","","","",""]
["TIFN","0. TRANSFERS TO INDIVIDUAL FISHERS - Non Budgetary","-","-","-","-","-","-","-","-","-",{"$f":"IF(OR(ISNUMBER(L16),ISNUMBER(L17)),SUM(L16,L17),\"\")","v":""},"","","","","","","","","","","","","","","","","","",{"$f":"IF(OR(ISNUMBER(AE16),ISNUMBER(AE17)),SUM(AE16,AE17),\"\")","v":""},""]
["MPS","0.A. Market price support","-","-","-","-","-","-","-","-","-",{"$f":"IF(COUNT(#REF!)=0,\"\",SUM(#REF!))","v":""},{"$f":"IF(COUNT(#REF!)=0,\"\",SUM(#REF!))","v":""},{"$f":"IF(COUNT(#REF!)=0,\"\",SUM(#REF!))","v":""},{"$f":"IF(COUNT(#REF!)=0,\"\",SUM(#REF!))","v":""},{"$f":"IF(COUNT(#REF!)=0,\"\",SUM(#REF!))","v":""},{"$f":"IF(COUNT(#REF!)=0,\"\",SUM(#REF!))","v":""},{"$f":"IF(COUNT(#REF!)=0,\"\",SUM(#REF!))","v":""},{"$f":"IF(COUNT(#REF!)=0,\"\",SUM(#REF!))","v":""},{"$f":"IF(COUNT(#REF!)=0,\"\",SUM(#REF!))","v":""},{"$f":"IF(COUNT(#REF!)=0,\"\",SUM(#REF!))","v":""},{"$f":"IF(COUNT(#REF!)=0,\"\",SUM(#REF!))","v":""},{"$f":"IF(COUNT(#REF!)=0,\"\",SUM(#REF!))","v":""},{"$f":"IF(COUNT(#REF!)=0,\"\",SUM(#REF!))","v":""},{"$f":"IF(COUNT(#REF!)=0,\"\",SUM(#REF!))","v":""},{"$f":"IF(COUNT(#REF!)=0,\"\",SUM(#REF!))","v":""},{"$f":"IF(COUNT(#REF!)=0,\"\",SUM(#REF!))","v":""},{"$f":"IF(COUNT(#REF!)=0,\"\",SUM(#REF!))","v":""},{"$f":"IF(COUNT(#REF!)=0,\"\",SUM(#REF!))","v":""},{"$f":"IF(COUNT(#REF!)=0,\"\",SUM(#REF!))","v":""},{"$f":"IF(COUNT(#REF!)=0,\"\",SUM(#REF!))","v":""},{"$f":"IF(COUNT(#REF!)=0,\"\",SUM(#REF!))","v":""}]
["FTC","0.B. Fuel tax concessions","-","-","-","-","-","-","-","-","-",{"$f":"IF(COUNT(#REF!)=0,\"\",SUM(#REF!))","v":""},{"$f":"IF(COUNT(#REF!)=0,\"\",SUM(#REF!))","v":""},{"$f":"IF(COUNT(#REF!)=0,\"\",SUM(#REF!))","v":""},{"$f":"IF(COUNT(#REF!)=0,\"\",SUM(#REF!))","v":""},{"$f":"IF(COUNT(#REF!)=0,\"\",SUM(#REF!))","v":""},{"$f":"IF(COUNT(#REF!)=0,\"\",SUM(#REF!))","v":""},{"$f":"IF(COUNT(#REF!)=0,\"\",SUM(#REF!))","v":""},{"$f":"IF(COUNT(#REF!)=0,\"\",SUM(#REF!))","v":""},{"$f":"IF(COUNT(#REF!)=0,\"\",SUM(#REF!))","v":""},{"$f":"IF(COUNT(#REF!)=0,\"\",SUM(#REF!))","v":""},{"$f":"IF(COUNT(#REF!)=0,\"\",SUM(#REF!))","v":""},{"$f":"IF(COUNT(#REF!)=0,\"\",SUM(#REF!))","v":""},{"$f":"IF(COUNT(#REF!)=0,\"\",SUM(#REF!))","v":""},{"$f":"IF(COUNT(#REF!)=0,\"\",SUM(#REF!))","v":""},{"$f":"IF(COUNT(#REF!)=0,\"\",SUM(#REF!))","v":""},{"$f":"IF(COUNT(#REF!)=0,\"\",SUM(#REF!))","v":""},{"$f":"IF(COUNT(#REF!)=0,\"\",SUM(#REF!))","v":""},{"$f":"IF(COUNT(#REF!)=0,\"\",SUM(#REF!))","v":""},{"$f":"IF(COUNT(#REF!)=0,\"\",SUM(#REF!))","v":""},{"$f":"IF(COUNT(#REF!)=0,\"\",SUM(#REF!))","v":""},{"$f":"IF(COUNT(#REF!)=0,\"\",SUM(#REF!))","v":""}]
["FSE_BUD","FISHERIES SUPPORT ESTIMATE - Budgetary","-","-","-","-","-","-","-","-","-",{"$f":"IF(OR(ISNUMBER(L19),ISNUMBER(L31),ISNUMBER(L45)),SUM(L19,L31,L45),\"\")","v":""},"","","","","","","","","","","","","","","","","","",{"$f":"IF(OR(ISNUMBER(AE19),ISNUMBER(AE31),ISNUMBER(AE45)),SUM(AE19,AE31,AE45),\"\")","v":""},""]
["TIFB","I. TRANSFERS TO INDIVIDUAL FISHERS - Budgetary","-","-","-","-","-","-","-","-","-",{"$f":"IF(OR(ISNUMBER(L20),ISNUMBER(L26),ISNUMBER(L29),ISNUMBER(L30)),SUM(L20,L26,L29,L30),\"\")","v":""},"","","","","","","","","","","","","","","","","","",{"$f":"IF(OR(ISNUMBER(AE20),ISNUMBER(AE26),ISNUMBER(AE29),ISNUMBER(AE30)),SUM(AE20,AE26,AE29,AE30),\"\")","v":""},""]
["IFINP","I.A. Transfers based on input use","-","-","-","-","-","-","-","-","-",{"$f":"IF(OR(ISNUMBER(L21),ISNUMBER(L22)),SUM(L21,L22),\"\")","v":""},"","","","","","","","","","","","","","","","","",{"$f":"IF(OR(ISNUMBER(AD21),ISNUMBER(AD22)),SUM(AD21,AD22),\"\")","v":""},"",{"$f":"IF(OR(ISNUMBER(AF21),ISNUMBER(AF22)),SUM(AF21,AF22),\"\")","v":""}]
["IFINP_VAR","I.A.1. Transfers based on variable input use","-","-","-","-","-","-","-","-","-",{"$f":"IF(COUNT(#REF!)=0,\"\",SUM(#REF!))","v":""},{"$f":"IF(COUNT(#REF!)=0,\"\",SUM(#REF!))","v":""},{"$f":"IF(COUNT(#REF!)=0,\"\",SUM(#REF!))","v":""},{"$f":"IF(COUNT(#REF!)=0,\"\",SUM(#REF!))","v":""},{"$f":"IF(COUNT(#REF!)=0,\"\",SUM(#REF!))","v":""},{"$f":"IF(COUNT(#REF!)=0,\"\",SUM(#REF!))","v":""},{"$f":"IF(COUNT(#REF!)=0,\"\",SUM(#REF!))","v":""},{"$f":"IF(COUNT(#REF!)=0,\"\",SUM(#REF!))","v":""},{"$f":"IF(COUNT(#REF!)=0,\"\",SUM(#REF!))","v":""},{"$f":"IF(COUNT(#REF!)=0,\"\",SUM(#REF!))","v":""},{"$f":"IF(COUNT(#REF!)=0,\"\",SUM(#REF!))","v":""},{"$f":"IF(COUNT(#REF!)=0,\"\",SUM(#REF!))","v":""},{"$f":"IF(COUNT(#REF!)=0,\"\",SUM(#REF!))","v":""},{"$f":"IF(COUNT(#REF!)=0,\"\",SUM(#REF!))","v":""},{"$f":"IF(COUNT(#REF!)=0,\"\",SUM(#REF!))","v":""},{"$f":"IF(COUNT(#REF!)=0,\"\",SUM(#REF!))","v":""},{"$f":"IF(COUNT(#REF!)=0,\"\",SUM(#REF!))","v":""},{"$f":"IF(COUNT(#REF!)=0,\"\",SUM(#REF!))","v":""},{"$f":"IF(COUNT(#REF!)=0,\"\",SUM(#REF!))","v":""},{"$f":"IF(COUNT(#REF!)=0,\"\",SUM(#REF!))","v":""},{"$f":"IF(COUNT(#REF!)=0,\"\",SUM(#REF!))","v":""}]
["IFINP_FIX","I.A.2. Transfers based on fixed capital formation","-","-","-","-","-","-","-","-","-",{"$f":"IF(OR(ISNUMBER(L23),ISNUMBER(L24),ISNUMBER(L25)),SUM(L23,L24,L25),\"\")","v":""},"","","","","","","","","","","","","","","","","","",{"$f":"IF(OR(ISNUMBER(AE23),ISNUMBER(AE24),ISNUMBER(AE25)),SUM(AE23,AE24,AE25),\"\")","v":""},""]
["IFINP_FIX_V","I.A.2.1. Support to vessel construction/purchase ","-","-","-","-","-","-","-","-","-",{"$f":"IF(COUNT(#REF!)=0,\"\",SUM(#REF!))","v":""},{"$f":"IF(COUNT(#REF!)=0,\"\",SUM(#REF!))","v":""},{"$f":"IF(COUNT(#REF!)=0,\"\",SUM(#REF!))","v":""},{"$f":"IF(COUNT(#REF!)=0,\"\",SUM(#REF!))","v":""},{"$f":"IF(COUNT(#REF!)=0,\"\",SUM(#REF!))","v":""},{"$f":"IF(COUNT(#REF!)=0,\"\",SUM(#REF!))","v":""},{"$f":"IF(COUNT(#REF!)=0,\"\",SUM(#REF!))","v":""},{"$f":"IF(COUNT(#REF!)=0,\"\",SUM(#REF!))","v":""},{"$f":"IF(COUNT(#REF!)=0,\"\",SUM(#REF!))","v":""},{"$f":"IF(COUNT(#REF!)=0,\"\",SUM(#REF!))","v":""},{"$f":"IF(COUNT(#REF!)=0,\"\",SUM(#REF!))","v":""},{"$f":"IF(COUNT(#REF!)=0,\"\",SUM(#REF!))","v":""},{"$f":"IF(COUNT(#REF!)=0,\"\",SUM(#REF!))","v":""},{"$f":"IF(COUNT(#REF!)=0,\"\",SUM(#REF!))","v":""},{"$f":"IF(COUNT(#REF!)=0,\"\",SUM(#REF!))","v":""},{"$f":"IF(COUNT(#REF!)=0,\"\",SUM(#REF!))","v":""},{"$f":"IF(COUNT(#REF!)=0,\"\",SUM(#REF!))","v":""},{"$f":"IF(COUNT(#REF!)=0,\"\",SUM(#REF!))","v":""},{"$f":"IF(COUNT(#REF!)=0,\"\",SUM(#REF!))","v":""},{"$f":"IF(COUNT(#REF!)=0,\"\",SUM(#REF!))","v":""},{"$f":"IF(COUNT(#REF!)=0,\"\",SUM(#REF!))","v":""}]
["IFINP_FIX_M","I.A.2.2. Support to modernisation  ","-","-","-","-","-","-","-","-","-",{"$f":"IF(COUNT(#REF!)=0,\"\",SUM(#REF!))","v":""},{"$f":"IF(COUNT(#REF!)=0,\"\",SUM(#REF!))","v":""},{"$f":"IF(COUNT(#REF!)=0,\"\",SUM(#REF!))","v":""},{"$f":"IF(COUNT(#REF!)=0,\"\",SUM(#REF!))","v":""},{"$f":"IF(COUNT(#REF!)=0,\"\",SUM(#REF!))","v":""},{"$f":"IF(COUNT(#REF!)=0,\"\",SUM(#REF!))","v":""},{"$f":"IF(COUNT(#REF!)=0,\"\",SUM(#REF!))","v":""},{"$f":"IF(COUNT(#REF!)=0,\"\",SUM(#REF!))","v":""},{"$f":"IF(COUNT(#REF!)=0,\"\",SUM(#REF!))","v":""},{"$f":"IF(COUNT(#REF!)=0,\"\",SUM(#REF!))","v":""},{"$f":"IF(COUNT(#REF!)=0,\"\",SUM(#REF!))","v":""},{"$f":"IF(COUNT(#REF!)=0,\"\",SUM(#REF!))","v":""},{"$f":"IF(COUNT(#REF!)=0,\"\",SUM(#REF!))","v":""},{"$f":"IF(COUNT(#REF!)=0,\"\",SUM(#REF!))","v":""},{"$f":"IF(COUNT(#REF!)=0,\"\",SUM(#REF!))","v":""},{"$f":"IF(COUNT(#REF!)=0,\"\",SUM(#REF!))","v":""},{"$f":"IF(COUNT(#REF!)=0,\"\",SUM(#REF!))","v":""},{"$f":"IF(COUNT(#REF!)=0,\"\",SUM(#REF!))","v":""},{"$f":"IF(COUNT(#REF!)=0,\"\",SUM(#REF!))","v":""},{"$f":"IF(COUNT(#REF!)=0,\"\",SUM(#REF!))","v":""},{"$f":"IF(COUNT(#REF!)=0,\"\",SUM(#REF!))","v":""}]
["IFINP_FIX_O","I.A.2.3. Support to other fixed costs","-","-","-","-","-","-","-","-","-",{"$f":"IF(COUNT(#REF!)=0,\"\",SUM(#REF!))","v":""},{"$f":"IF(COUNT(#REF!)=0,\"\",SUM(#REF!))","v":""},{"$f":"IF(COUNT(#REF!)=0,\"\",SUM(#REF!))","v":""},{"$f":"IF(COUNT(#REF!)=0,\"\",SUM(#REF!))","v":""},{"$f":"IF(COUNT(#REF!)=0,\"\",SUM(#REF!))","v":""},{"$f":"IF(COUNT(#REF!)=0,\"\",SUM(#REF!))","v":""},{"$f":"IF(COUNT(#REF!)=0,\"\",SUM(#REF!))","v":""},{"$f":"IF(COUNT(#REF!)=0,\"\",SUM(#REF!))","v":""},{"$f":"IF(COUNT(#REF!)=0,\"\",SUM(#REF!))","v":""},{"$f":"IF(COUNT(#REF!)=0,\"\",SUM(#REF!))","v":""},{"$f":"IF(COUNT(#REF!)=0,\"\",SUM(#REF!))","v":""},{"$f":"IF(COUNT(#REF!)=0,\"\",SUM(#REF!))","v":""},{"$f":"IF(COUNT(#REF!)=0,\"\",SUM(#REF!))","v":""},{"$f":"IF(COUNT(#REF!)=0,\"\",SUM(#REF!))","v":""},{"$f":"IF(COUNT(#REF!)=0,\"\",SUM(#REF!))","v":""},{"$f":"IF(COUNT(#REF!)=0,\"\",SUM(#REF!))","v":""},{"$f":"IF(COUNT(#REF!)=0,\"\",SUM(#REF!))","v":""},{"$f":"IF(COUNT(#REF!)=0,\"\",SUM(#REF!))","v":""},{"$f":"IF(COUNT(#REF!)=0,\"\",SUM(#REF!))","v":""},{"$f":"IF(COUNT(#REF!)=0,\"\",SUM(#REF!))","v":""},{"$f":"IF(COUNT(#REF!)=0,\"\",SUM(#REF!))","v":""}]
["IFINC","I.B. Transfers based on fishers income ","-","-","-","-","-","-","-","-","-",{"$f":"IF(OR(ISNUMBER(L27),ISNUMBER(L28)),SUM(L27,L28),\"\")","v":""},"","","","","","","","","","","","","","","","","",{"$f":"IF(OR(ISNUMBER(AD27),ISNUMBER(AD28)),SUM(AD27,AD28),\"\")","v":""},"",{"$f":"IF(OR(ISNUMBER(AF27),ISNUMBER(AF28)),SUM(AF27,AF28),\"\")","v":""}]
["IFINC_INS","I.B.1. Income support","-","-","-","-","-","-","-","-","-",{"$f":"IF(COUNT(#REF!)=0,\"\",SUM(#REF!))","v":""},{"$f":"IF(COUNT(#REF!)=0,\"\",SUM(#REF!))","v":""},{"$f":"IF(COUNT(#REF!)=0,\"\",SUM(#REF!))","v":""},{"$f":"IF(COUNT(#REF!)=0,\"\",SUM(#REF!))","v":""},{"$f":"IF(COUNT(#REF!)=0,\"\",SUM(#REF!))","v":""},{"$f":"IF(COUNT(#REF!)=0,\"\",SUM(#REF!))","v":""},{"$f":"IF(COUNT(#REF!)=0,\"\",SUM(#REF!))","v":""},{"$f":"IF(COUNT(#REF!)=0,\"\",SUM(#REF!))","v":""},{"$f":"IF(COUNT(#REF!)=0,\"\",SUM(#REF!))","v":""},{"$f":"IF(COUNT(#REF!)=0,\"\",SUM(#REF!))","v":""},{"$f":"IF(COUNT(#REF!)=0,\"\",SUM(#REF!))","v":""},{"$f":"IF(COUNT(#REF!)=0,\"\",SUM(#REF!))","v":""},{"$f":"IF(COUNT(#REF!)=0,\"\",SUM(#REF!))","v":""},{"$f":"IF(COUNT(#REF!)=0,\"\",SUM(#REF!))","v":""},{"$f":"IF(COUNT(#REF!)=0,\"\",SUM(#REF!))","v":""},{"$f":"IF(COUNT(#REF!)=0,\"\",SUM(#REF!))","v":""},{"$f":"IF(COUNT(#REF!)=0,\"\",SUM(#REF!))","v":""},{"$f":"IF(COUNT(#REF!)=0,\"\",SUM(#REF!))","v":""},{"$f":"IF(COUNT(#REF!)=0,\"\",SUM(#REF!))","v":""},{"$f":"IF(COUNT(#REF!)=0,\"\",SUM(#REF!))","v":""},{"$f":"IF(COUNT(#REF!)=0,\"\",SUM(#REF!))","v":""}]
["IFINC_SIF","I.B.2. Special insurance system for fishers","-","-","-","-","-","-","-","-","-",{"$f":"IF(COUNT(#REF!)=0,\"\",SUM(#REF!))","v":""},{"$f":"IF(COUNT(#REF!)=0,\"\",SUM(#REF!))","v":""},{"$f":"IF(COUNT(#REF!)=0,\"\",SUM(#REF!))","v":""},{"$f":"IF(COUNT(#REF!)=0,\"\",SUM(#REF!))","v":""},{"$f":"IF(COUNT(#REF!)=0,\"\",SUM(#REF!))","v":""},{"$f":"IF(COUNT(#REF!)=0,\"\",SUM(#REF!))","v":""},{"$f":"IF(COUNT(#REF!)=0,\"\",SUM(#REF!))","v":""},{"$f":"IF(COUNT(#REF!)=0,\"\",SUM(#REF!))","v":""},{"$f":"IF(COUNT(#REF!)=0,\"\",SUM(#REF!))","v":""},{"$f":"IF(COUNT(#REF!)=0,\"\",SUM(#REF!))","v":""},{"$f":"IF(COUNT(#REF!)=0,\"\",SUM(#REF!))","v":""},{"$f":"IF(COUNT(#REF!)=0,\"\",SUM(#REF!))","v":""},{"$f":"IF(COUNT(#REF!)=0,\"\",SUM(#REF!))","v":""},{"$f":"IF(COUNT(#REF!)=0,\"\",SUM(#REF!))","v":""},{"$f":"IF(COUNT(#REF!)=0,\"\",SUM(#REF!))","v":""},{"$f":"IF(COUNT(#REF!)=0,\"\",SUM(#REF!))","v":""},{"$f":"IF(COUNT(#REF!)=0,\"\",SUM(#REF!))","v":""},{"$f":"IF(COUNT(#REF!)=0,\"\",SUM(#REF!))","v":""},{"$f":"IF(COUNT(#REF!)=0,\"\",SUM(#REF!))","v":""},{"$f":"IF(COUNT(#REF!)=0,\"\",SUM(#REF!))","v":""},{"$f":"IF(COUNT(#REF!)=0,\"\",SUM(#REF!))","v":""}]
["IFRPC","I.C. Transfers based on the reduction of productive capacity","-","-","-","-","-","-","-","-","-",{"$f":"IF(COUNT(#REF!)=0,\"\",SUM(#REF!))","v":""},{"$f":"IF(COUNT(#REF!)=0,\"\",SUM(#REF!))","v":""},{"$f":"IF(COUNT(#REF!)=0,\"\",SUM(#REF!))","v":""},{"$f":"IF(COUNT(#REF!)=0,\"\",SUM(#REF!))","v":""},{"$f":"IF(COUNT(#REF!)=0,\"\",SUM(#REF!))","v":""},{"$f":"IF(COUNT(#REF!)=0,\"\",SUM(#REF!))","v":""},{"$f":"IF(COUNT(#REF!)=0,\"\",SUM(#REF!))","v":""},{"$f":"IF(COUNT(#REF!)=0,\"\",SUM(#REF!))","v":""},{"$f":"IF(COUNT(#REF!)=0,\"\",SUM(#REF!))","v":""},{"$f":"IF(COUNT(#REF!)=0,\"\",SUM(#REF!))","v":""},{"$f":"IF(COUNT(#REF!)=0,\"\",SUM(#REF!))","v":""},{"$f":"IF(COUNT(#REF!)=0,\"\",SUM(#REF!))","v":""},{"$f":"IF(COUNT(#REF!)=0,\"\",SUM(#REF!))","v":""},{"$f":"IF(COUNT(#REF!)=0,\"\",SUM(#REF!))","v":""},{"$f":"IF(COUNT(#REF!)=0,\"\",SUM(#REF!))","v":""},{"$f":"IF(COUNT(#REF!)=0,\"\",SUM(#REF!))","v":""},{"$f":"IF(COUNT(#REF!)=0,\"\",SUM(#REF!))","v":""},{"$f":"IF(COUNT(#REF!)=0,\"\",SUM(#REF!))","v":""},{"$f":"IF(COUNT(#REF!)=0,\"\",SUM(#REF!))","v":""},{"$f":"IF(COUNT(#REF!)=0,\"\",SUM(#REF!))","v":""},{"$f":"IF(COUNT(#REF!)=0,\"\",SUM(#REF!))","v":""}]
["IFMSC","I.D. Miscellaneous transfers to fishers","-","-","-","-","-","-","-","-","-",{"$f":"IF(COUNT(#REF!)=0,\"\",SUM(#REF!))","v":""},{"$f":"IF(COUNT(#REF!)=0,\"\",SUM(#REF!))","v":""},{"$f":"IF(COUNT(#REF!)=0,\"\",SUM(#REF!))","v":""},{"$f":"IF(COUNT(#REF!)=0,\"\",SUM(#REF!))","v":""},{"$f":"IF(COUNT(#REF!)=0,\"\",SUM(#REF!))","v":""},{"$f":"IF(COUNT(#REF!)=0,\"\",SUM(#REF!))","v":""},{"$f":"IF(COUNT(#REF!)=0,\"\",SUM(#REF!))","v":""},{"$f":"IF(COUNT(#REF!)=0,\"\",SUM(#REF!))","v":""},{"$f":"IF(COUNT(#REF!)=0,\"\",SUM(#REF!))","v":""},{"$f":"IF(COUNT(#REF!)=0,\"\",SUM(#REF!))","v":""},{"$f":"IF(COUNT(#REF!)=0,\"\",SUM(#REF!))","v":""},{"$f":"IF(COUNT(#REF!)=0,\"\",SUM(#REF!))","v":""},{"$f":"IF(COUNT(#REF!)=0,\"\",SUM(#REF!))","v":""},{"$f":"IF(COUNT(#REF!)=0,\"\",SUM(#REF!))","v":""},{"$f":"IF(COUNT(#REF!)=0,\"\",SUM(#REF!))","v":""},{"$f":"IF(COUNT(#REF!)=0,\"\",SUM(#REF!))","v":""},{"$f":"IF(COUNT(#REF!)=0,\"\",SUM(#REF!))","v":""},{"$f":"IF(COUNT(#REF!)=0,\"\",SUM(#REF!))","v":""},{"$f":"IF(COUNT(#REF!)=0,\"\",SUM(#REF!))","v":""},{"$f":"IF(COUNT(#REF!)=0,\"\",SUM(#REF!))","v":""},{"$f":"IF(COUNT(#REF!)=0,\"\",SUM(#REF!))","v":""}]
{"$rows_left_out":22}
{"sheet":"METADATA","index":3,"n_rows":42,"n_cols":2,"rows_kept":42,"cut":false,"hidden":false,"merged":[[27,1,27,3],[28,1,28,3],[29,1,29,3],[30,1,30,3],[31,1,31,3],[38,1,38,3],[39,1,39,3],[40,1,40,3],[41,1,41,3],[32,1,32,3],[33,1,33,3],[34,1,34,3],[35,1,35,3],[36,1,36,3],[37,1,37,3],[25,1,25,3],[26,1,26,3],[17,1,17,3],[20,1,20,3],[21,1,21,3],[22,1,22,3],[23,1,23,3],[24,1,24,3],[19,1,19,3],[18,1,18,3],[1,1,1,3],[5,1,5,3],[6,1,6,3],[9,1,9,3],[2,1,2,3],[3,1,3,3],[7,1,7,3],[16,1,16,3],[10,1,10,3],[11,1,11,3],[12,1,12,3],[13,1,13,3],[14,1,14,3],[15,1,15,3]]}
[]
[null,"METADATA"]
[null,"Report here the information you deem useful to better understand and interpret your data, and also any possible difference between your data and the INSTRUCTIONS given."]
[null,"Please remember that this is essential to control the quality of the data, and it is part of the data collection."]
[]
[null,"FISHERIES SUPPORT ESTIMATE - TOTAL"]
[null,"FISHERIES SUPPORT ESTIMATE - Non Budgetary"]
[null,"0.B. Fuel tax concessions"]
[null,"0.A. Market price support"]
[null,"FISHERIES SUPPORT ESTIMATE - Budgetary"]
[null,"I. TRANSFERS TO INDIVIDUAL FISHERS - Budgetary"]
[null,"I.A. Transfers based on input use"]
[null,"I.A.1. Transfers based on variable input use"]
[null,"I.A.2. Transfers based on fixed capital formation"]
[null,"I.A.2.1. Support to vessel construction/purchase "]
[null,"I.A.2.2. Support to modernisation  "]
[null,"I.A.2.3. Support to other fixed costs"]
[null,"I.B. Transfers based on fishers income "]
[null,"I.B.1. Income support"]
[null,"I.B.2. Special insurance system for fishers"]
[null,"I.C. Transfers based on the reduction of productive capacity"]
[null,"I.D. Miscellaneous transfers to fishers"]
[null,"II. GENERAL SERVICE SUPPORT ESTIMATE"]
[null,"II.A. Access to other countries’ waters"]
[null,"II.B. Provision of infrastructure"]
[null,"II.B.1. Capital expenditures"]
[null,"II.B.2. Subsidized access to infrastructure"]
[null,"II.C. Marketing and promotion"]
[null,"II.D. Support to fishing communities"]
[null,"II.E. Education and training"]
{"$rows_left_out":13}
{"sheet":"FEEDBACK","index":4,"n_rows":17,"n_cols":2,"rows_kept":17,"cut":false,"hidden":false,"merged":[[4,1,4,8],[4,9,4,20],[6,1,6,8],[6,9,6,20],[8,1,8,8],[8,9,8,20],[16,1,16,8],[16,9,16,20],[10,1,10,8],[10,9,10,20],[12,1,12,8],[12,9,12,20],[14,1,14,8],[14,9,14,20]]}
[]
[null,"FEEDBACK"]
[null,"This section is optional but helpful to improve the questionnaire's design over time."]
[]
[null,"1. How long did it take you to complete the questionnaire?"]
[]
[null,"2. How long did it take you to retrieve information to complete the questionnaire?"]
[]
[null,"3. How many people in your Organisation were involved in completing the questionnaire?"]
[]
[null,"4. Were there any sections that you found difficult to complete and why?"]
[]
[null,"5. Did you find the instruction page clear and useful?"]
[]
[null,"6. Please confirm if the questionnaire was sent directly to the right person/office."]
[]
[null,"7. Do you have any other suggestion for improvement?"]

{"sheet":"FSE Classification","index":5,"n_rows":40,"n_cols":3,"rows_kept":40,"cut":false,"hidden":true,"merged":[]}
[]
[null,"FSE","FISHERIES SUPPORT ESTIMATE - TOTAL"]
[null,"FSE_NON","FISHERIES SUPPORT ESTIMATE - Non Budgetary"]
[null,"TIFN","0. TRANSFERS TO INDIVIDUAL FISHERS - Non Budgetary"]
[null,"MPS","0.A. Market price support"]
[null,"FTC","0.B. Fuel tax concessions"]
[null,"FSE_BUD","FISHERIES SUPPORT ESTIMATE - Budgetary"]
[null,"TIFB","I. TRANSFERS TO INDIVIDUAL FISHERS - Budgetary"]
[null,"IFINP","I.A. Transfers based on input use"]
[null,"IFINP_VAR","I.A.1. Transfers based on variable input use"]
[null,"IFINP_FIX","I.A.2. Transfers based on fixed capital formation"]
[null,"IFINP_FIX_V","I.A.2.1.Support to vessel construction/purchase "]
[null,"IFINP_FIX_M","I.A.2.2.Support to modernisation  "]
[null,"IFINP_FIX_O","I.A.2.3.Support to other fixed costs"]
[null,"IFINC","I.B. Transfers based on fishers income "]
[null,"IFINC_INS","I.B.1. Income support"]
[null,"IFINC_SIF","I.B.2. Special insurance system for fishers"]
[null,"IFRPC","I.C. Transfers based on the reduction of productive capacity"]
[null,"IFMSC","I.D. Miscellaneous transfers to fishers"]
[null,"GSSE","II. GENERAL SERVICE SUPPORT ESTIMATE"]
[null,"GSACC","II.A. Access to other countries’ waters"]
[null,"GSINF","II.B. Provision of infrastructure"]
[null,"GSINF_CAP","II.B.1. Capital expenditures"]
[null,"GSINF_ACC","II.B.2. Subsidized access to infrastructure"]
[null,"GSMKG","II.C. Marketing and promotion"]
[null,"GSCOM","II.D. Support to fishing communities"]
[null,"GSEDU","II.E. Education and training"]
[null,"GSRND","II.F. Research and development "]
[null,"GSMNG","II.G. Management of resources"]
[null,"GSMNG_EXP","II.G.1. Management expenditures "]
{"$rows_left_out":11}
{"sheet":"CODES Mapping","index":6,"n_rows":241,"n_cols":4,"rows_kept":241,"cut":false,"hidden":true,"merged":[]}
["Country","OECD CODE","Currency","ISO CODE"]
["Australia","AUS","Australian Dollar","AUD"]
["Austria","AUT","Euro","EUR"]
["Belgium","BEL","Euro","EUR"]
["Canada","CAN","Canadian Dollar","CAD"]
["Chile","CHL","Chilean Peso","CLP"]
["Czech Republic","CZE","Czech Koruna","CZK"]
["Denmark","DNK","Danish Krone","DKK"]
["Estonia","EST","Euro","EUR"]
["Finland","FIN","Euro","EUR"]
["France","FRA","Euro","EUR"]
["Germany","DEU","Euro","EUR"]
["Greece","GRC","Euro","EUR"]
["Hungary","HUN","Forint","HUF"]
["Iceland","ISL","Iceland Krona","ISK"]
["Ireland","IRL","Euro","EUR"]
["Israel","ISR","New Israeli Sheqel","ILS"]
["Italy","ITA","Euro","EUR"]
["Japan","JPN","Yen","JPY"]
["Korea","KOR","Won","KRW"]
["Luxembourg","LUX","Euro","EUR"]
["Mexico","MEX","Mexican Peso","MXN"]
["Netherlands","NLD","Euro","EUR"]
["New Zealand","NZL","New Zealand Dollar","NZD"]
["Norway","NOR","Norwegian Krone","NOK"]
["Poland","POL","Zloty","PLN"]
["Portugal","PRT","Euro","EUR"]
["Slovak Republic","SVK","Euro","EUR"]
["Slovenia","SVN","Euro","EUR"]
["Spain","ESP","Euro","EUR"]
{"$rows_left_out":211}